aerospace-x standard data package
type: Ontology
access URL: https://w3id.org/aerospace-x/ontology/genericDataPackage/0.1.0#
created: 2026-01-22
description: The models describe aerospace-x concept for dataproduct and notification and semantic standard data package types that can be exchanged on the dataspace.
modified: 2026-01-22
publisher: aerospace-x
version IRI: 0.1.0#
version info: 0.1.0

Aerospace-X Standard
type: Class
comment: Represents a reusable class to declare aerospace-x data standards.
subclass of: Standard
definition: A SHACL-based semantic standard that Aerospace-X datasets must conform to.

Generic Aerospace-X Dataproduct
type: Class
comment: Domain-specific dataproduct must subclass this type.
subclass of: Dataset
definition: Abstract class of a generic dataset exchanged under an EDC-negotiated Aerospace-X asset. The asset can be the dataproduct itsel of a dataproduct serie.

Generic Aerospace-X Dataproduct Series
type: Class
comment: Domain-specific dataproduct series must subclass this.
subclass of: DatasetSeries
definition: Abstract class of a generic series of datasets exchanged under a Aerospace-X negotiated EDC asset.

Generic Domain Entity
type: Class
comment: Domain specific entities must subclass this type
definition: An abstract class for domain-specific objects referenced by Aerospace-X datasets.

Generic Aerospace-X Notification
type: Class
comment: Notifications are not datasets but follow a semantic standard and may be exchanged between partners.
definition: Abstract class representing a notification exchanged in the Aerospace-X dataspace.

conforms to standard
type: ObjectProperty
comment: Indicates that a dataset or a notification conforms to a Decade-X SHACL-based standard.
domain: Class
  union of: Generic Aerospace-X Dataproduct
  union of: Generic Aerospace-X Notification
range: Aerospace-X Standard
sub property of: conformsTo

dataProvider
type: AnnotationProperty
type: ObjectProperty
domain: Generic Aerospace-X Dataproduct
range: Partner
sub property of: publisher
definition: Partner exposing or providing the dataset on the dataspace.

dataReceiver
type: ObjectProperty
domain: Generic Aerospace-X Dataproduct
range: Partner
sub property of: audience
definition: Partner to which a dataset is provided to by the data provider.

in series
type: ObjectProperty
comment: Links a dataset instance to the DatasetSeries instance negotiated during the Dataspace Protocol.
domain: Generic Aerospace-X Dataproduct
range: Generic Aerospace-X Dataproduct Series
sub property of: inSeries

lastModificationDate
type: AnnotationProperty
type: DatatypeProperty
domain: Generic Aerospace-X Dataproduct
range: dateTime
sub property of: modified
definition: Last modification date of the dataproduct.

notificationComment
type: DatatypeProperty
domain: Generic Aerospace-X Notification
range: string
definition: Notification comment provided by the data provider.

notificationCriticity
type: DatatypeProperty
domain: Generic Aerospace-X Notification
range: string
definition: criticity level of the notification

notificationDate
type: DatatypeProperty
domain: Generic Aerospace-X Notification
range: dateTime
sub property of: issued
definition: Date of the notification.

Notification provider
type: AnnotationProperty
type: ObjectProperty
domain: Generic Aerospace-X Notification
range: Partner
sub property of: publisher
definition: Partner that issues the notification.

Notification receiver
type: ObjectProperty
domain: Generic Aerospace-X Notification
range: Partner
sub property of: audience
definition: Partner that is intended to receive the notification.

publicationDate
type: DatatypeProperty
domain: Generic Aerospace-X Dataproduct
range: dateTime
sub property of: issued
definition: Publication date of the dataproduct.

Reference of an domain entity
type: ObjectProperty
comment: Associates a dataset with domain-specific entities it describes.
domain: Generic Aerospace-X Dataproduct
range: Generic Domain Entity

version
type: DatatypeProperty
domain: Generic Aerospace-X Dataproduct
range: string
sub property of: version
definition: Version of the dataproduct, provided in a string with respect of the semver.org standard